Reaction Details
TargetSerine/threonine-protein kinase ATR
LigandBDBM268043
Substrate/Competitorn/a
Meas. Tech.Time-Resolved Fluorescence Energy Transfer (TR-FRET Tracer A)
pH7±n/a
IC50 6.97±n/a nM
Commentsextracted
Citation Wortmann, LLücking, ULefranc, JBriem, HVon Nussbaum, FBader, BSiemeister, GBone, WLienau, PMoosmayer, DEberspächer, USchick, HEis, KKoppitz, MWengner, AMGrudzinska-Goebel, J 2-(morpholin-4-yl)-1,7-naphthyridines US Patent US9549932 Publication Date 1/24/2017
 
Serine/threonine-protein kinase ATR
Name:Serine/threonine-protein kinase ATR
Type:Protein
Mol. Mass.:301404.58
Organism:Homo sapiens (Human)
Description:Q13535
Residue:2644
BDBM268043
NameBDBM268043
Synonyms:4-fluoro-2-[2-[(3R)-3-methylmorpholin-4-yl]-8-(1H-pyrazol-5-yl)-1,7-naphthyridin-4-yl]aniline | US9549932, 75
TypeSmall organic molecule
Emp. Form.C27H29FN6O2
Mol. Mass.488.5566
SMILESC[C@@H]1COCCN1c1cc(-c2cc(F)ccc2N)c2ccnc(-c3ccnn3C3CCCCO3)c2n1