Reaction Details
TargetSerine/threonine-protein kinase ATR
LigandBDBM268058
Substrate/Competitorn/a
Meas. Tech.Time-Resolved Fluorescence Energy Transfer (TR-FRET Tracer A)
pH7±n/a
IC50 10.6±n/a nM
Commentsextracted
Citation Wortmann, LLücking, ULefranc, JBriem, HVon Nussbaum, FBader, BSiemeister, GBone, WLienau, PMoosmayer, DEberspächer, USchick, HEis, KKoppitz, MWengner, AMGrudzinska-Goebel, J 2-(morpholin-4-yl)-1,7-naphthyridines US Patent US9549932 Publication Date 1/24/2017
 
Serine/threonine-protein kinase ATR
Name:Serine/threonine-protein kinase ATR
Type:Protein
Mol. Mass.:301404.58
Organism:Homo sapiens (Human)
Description:Q13535
Residue:2644
BDBM268058
NameBDBM268058
Synonyms:4-(2-fluoro-4-methylpyridin-3-yl)-2-[(3R)-3-methylmorpholin-4-yl]-8-(1H-pyrazol-5-yl)-1,7-naphthyridine US11529356, Example 90 | US9549932, 90
TypeSmall organic molecule
Emp. Form.C22H21FN6O
Mol. Mass.404.4401
SMILESC[C@@H]1COCCN1c1cc(-c2c(C)ccnc2F)c2ccnc(-c3ccn[nH]3)c2n1