Reaction Details
TargetSerine/threonine-protein kinase ATR
LigandBDBM268073
Substrate/Competitorn/a
Meas. Tech.Time-Resolved Fluorescence Energy Transfer (TR-FRET Tracer A)
pH7±n/a
IC50 8.67±n/a nM
Commentsextracted
Citation Wortmann, LLücking, ULefranc, JBriem, HVon Nussbaum, FBader, BSiemeister, GBone, WLienau, PMoosmayer, DEberspächer, USchick, HEis, KKoppitz, MWengner, AMGrudzinska-Goebel, J 2-(morpholin-4-yl)-1,7-naphthyridines US Patent US9549932 Publication Date 1/24/2017
 
Serine/threonine-protein kinase ATR
Name:Serine/threonine-protein kinase ATR
Type:Protein
Mol. Mass.:301404.58
Organism:Homo sapiens (Human)
Description:Q13535
Residue:2644
BDBM268073
NameBDBM268073
Synonyms:4-(3,5-dimethyl-1,2-oxazol-4-yl)-2-[(3R)-3-methylmorpholin-4-yl]-8-(1H-pyrazol-5-yl)-1,7-naphthyridine US11529356, Example 105 | US9549932, 105
TypeSmall organic molecule
Emp. Form.C21H22N6O2
Mol. Mass.390.4384
SMILESC[C@@H]1COCCN1c1cc(-c2c(C)noc2C)c2ccnc(-c3ccn[nH]3)c2n1