Reaction Details
TargetMitogen-activated protein kinase kinase kinase kinase 2
LigandBDBM54957
Substrate/Competitorn/a
Meas. Tech.Dose Response of SAR compounds via Multiplex HTS Assay for Inhibitors of MEK Kinase PB1 Domains, specifically MEK5 binding to MEK Kinase 2 Wildtype
EC50>30000±n/a nM
Citation PubChem, PC Dose Response of SAR compounds via Multiplex HTS Assay for Inhibitors of MEK Kinase PB1 Domains, specifically MEK5 binding to MEK Kinase 2 Wildtype PubChem Bioassay(2009)[AID]
 
Mitogen-activated protein kinase kinase kinase kinase 2
Name:Mitogen-activated protein kinase kinase kinase kinase 2
Type:n/a
Mol. Mass.:91551.35
Organism:Homo sapiens (Human)
Description:n/a
Residue:820
BDBM54957
NameBDBM54957
Synonyms:6-(2-methoxy-4-nitro-phenyl)-3-(2-pyridyl)-[1,2,4]triazolo[3,4-b][1,3,4]thiadiazole 6-(2-methoxy-4-nitrophenyl)-3-(2-pyridinyl)-[1,2,4]triazolo[3,4-b][1,3,4]thiadiazole VU0364707-1 | cid_44236879
TypeSmall organic molecule
Emp. Form.C15H10N6O3S
Mol. Mass.354.343
SMILESCOc1cc(ccc1-c1nn2c(nnc2s1)-c1ccccn1)[N+]([O-])=O