Reaction Details
TargetCore protein
LigandBDBM31757
Substrate/Competitorn/a
Meas. Tech.TR-FRET-based biochemical high-throughput dose response assay to identify inhibitors of Hepatitis C Virus (HCV) core protein dimerization.
IC50>49751±n/a nM
Citation PubChem, PC TR-FRET-based biochemical high-throughput dose response assay to identify inhibitors of Hepatitis C Virus (HCV) core protein dimerization. PubChem Bioassay(2009)[AID]
 
Core protein
Name:Core protein
Synonyms:n/a
Type:Enzyme Catalytic Domain
Mol. Mass.:14237.71
Organism:Hepatitis C virus
Description:gi_83779224
Residue:126
BDBM31757
NameBDBM31757
TypeSmall organic molecule
Emp. Form.C13H13NO3
Mol. Mass.231.2472
SMILESOC(=O)C1Nc2c(O)cccc2C2C=CCC12