Reaction Details
TargetCore protein
LigandBDBM50019
Substrate/Competitorn/a
Meas. Tech.TR-FRET-based biochemical high-throughput dose response assay to identify inhibitors of Hepatitis C Virus (HCV) core protein dimerization.
IC50>49751±n/a nM
Citation PubChem, PC TR-FRET-based biochemical high-throughput dose response assay to identify inhibitors of Hepatitis C Virus (HCV) core protein dimerization. PubChem Bioassay(2009)[AID]
 
Core protein
Name:Core protein
Synonyms:n/a
Type:Enzyme Catalytic Domain
Mol. Mass.:14237.71
Organism:Hepatitis C virus
Description:gi_83779224
Residue:126
BDBM50019
NameBDBM50019
TypeSmall organic molecule
Emp. Form.C18H15N7OS
Mol. Mass.377.423
SMILESCc1cc(C)n2c(SCC(=O)C(C#N)c3nc4ccccc4[nH]3)nnc2n1