Reaction Details
TargetCore protein
LigandBDBM34295
Substrate/Competitorn/a
Meas. Tech.TR-FRET-based biochemical high-throughput dose response assay to identify inhibitors of Hepatitis C Virus (HCV) core protein dimerization.
IC50>49751±n/a nM
Citation PubChem, PC TR-FRET-based biochemical high-throughput dose response assay to identify inhibitors of Hepatitis C Virus (HCV) core protein dimerization. PubChem Bioassay(2009)[AID]
 
Core protein
Name:Core protein
Synonyms:n/a
Type:Enzyme Catalytic Domain
Mol. Mass.:14237.71
Organism:Hepatitis C virus
Description:gi_83779224
Residue:126
BDBM34295
NameBDBM34295
TypeSmall organic molecule
Emp. Form.C20H19N3O2S
Mol. Mass.365.449
SMILESCc1ccc(o1)C1CC(=O)N2CN(CSC2=C1C#N)c1cccc(C)c1