Reaction Details
TargetCore protein
LigandBDBM33075
Substrate/Competitorn/a
Meas. Tech.TR-FRET-based biochemical high-throughput dose response assay to identify inhibitors of Hepatitis C Virus (HCV) core protein dimerization.
IC50>49751±n/a nM
Citation PubChem, PC TR-FRET-based biochemical high-throughput dose response assay to identify inhibitors of Hepatitis C Virus (HCV) core protein dimerization. PubChem Bioassay(2009)[AID]
 
Core protein
Name:Core protein
Synonyms:n/a
Type:Enzyme Catalytic Domain
Mol. Mass.:14237.71
Organism:Hepatitis C virus
Description:gi_83779224
Residue:126
BDBM33075
NameBDBM33075
TypeSmall organic molecule
Emp. Form.C24H14F3N3O3
Mol. Mass.449.3815
SMILESFC(F)(F)c1cccc(NC(=O)c2ccc3nc(-c4ccco4)c(nc3c2)-c2ccco2)c1