Reaction Details
TargetCore protein
LigandBDBM32280
Substrate/Competitorn/a
Meas. Tech.TR-FRET-based biochemical high-throughput dose response assay to identify inhibitors of Hepatitis C Virus (HCV) core protein dimerization.
IC50>49751±n/a nM
Citation PubChem, PC TR-FRET-based biochemical high-throughput dose response assay to identify inhibitors of Hepatitis C Virus (HCV) core protein dimerization. PubChem Bioassay(2009)[AID]
 
Core protein
Name:Core protein
Synonyms:n/a
Type:Enzyme Catalytic Domain
Mol. Mass.:14237.71
Organism:Hepatitis C virus
Description:gi_83779224
Residue:126
BDBM32280
NameBDBM32280
TypeSmall organic molecule
Emp. Form.C25H17N3O4
Mol. Mass.423.4202
SMILESCC(=O)c1ccc(NC(=O)c2ccc3nc(-c4ccco4)c(nc3c2)-c2ccco2)cc1