Reaction Details
TargetCore protein
LigandBDBM47242
Substrate/Competitorn/a
Meas. Tech.TR-FRET-based biochemical high-throughput dose response assay to identify inhibitors of Hepatitis C Virus (HCV) core protein dimerization.
IC50>49751±n/a nM
Citation PubChem, PC TR-FRET-based biochemical high-throughput dose response assay to identify inhibitors of Hepatitis C Virus (HCV) core protein dimerization. PubChem Bioassay(2009)[AID]
 
Core protein
Name:Core protein
Synonyms:n/a
Type:Enzyme Catalytic Domain
Mol. Mass.:14237.71
Organism:Hepatitis C virus
Description:gi_83779224
Residue:126
BDBM47242
NameBDBM47242
TypeSmall organic molecule
Emp. Form.C16H16BrNO2
Mol. Mass.334.208
SMILESCc1cc(Br)c2nc3CCCCCc3c(C(O)=O)c2c1