Reaction Details
Target2'-phosphotransferase
LigandBDBM55008
Substrate/Competitorn/a
Meas. Tech.Fluorescence polarization-based biochemical high throughput dose response assay to identify inhibitors of tRNA 2'-phosphotransferase (TPT1).
IC50 1686±n/a nM
Citation PubChem, PC Fluorescence polarization-based biochemical high throughput dose response assay to identify inhibitors of tRNA 2'-phosphotransferase (TPT1). PubChem Bioassay(2009)[AID]
 
2'-phosphotransferase
Name:2'-phosphotransferase
Synonyms:likely tRNA 2'-phosphotransferase
Type:Enzyme Catalytic Domain
Mol. Mass.:23631.37
Organism:Candida albicans SC5314
Description:gi_68476498
Residue:207
BDBM55008
NameBDBM55008
TypeSmall organic molecule
Emp. Form.C22H19N4O8S2
Mol. Mass.531.539
SMILESNC(=O)c1cc[n+](CC2=C(N3[C@H](SC2)[C@H](NC(=O)C(c2ccccc2)S([O-])(=O)=O)C3=O)C([O-])=O)cc1