Reaction Details
Target2'-phosphotransferase
LigandBDBM44482
Substrate/Competitorn/a
Meas. Tech.Fluorescence polarization-based biochemical high throughput dose response assay to identify inhibitors of tRNA 2'-phosphotransferase (TPT1).
IC50 20491±n/a nM
Citation PubChem, PC Fluorescence polarization-based biochemical high throughput dose response assay to identify inhibitors of tRNA 2'-phosphotransferase (TPT1). PubChem Bioassay(2009)[AID]
 
2'-phosphotransferase
Name:2'-phosphotransferase
Synonyms:likely tRNA 2'-phosphotransferase
Type:Enzyme Catalytic Domain
Mol. Mass.:23631.37
Organism:Candida albicans SC5314
Description:gi_68476498
Residue:207
BDBM44482
NameBDBM44482
TypeSmall organic molecule
Emp. Form.C15H15NO4S2
Mol. Mass.337.414
SMILESCC(C)C(N1C(=S)S\C(=C/C=C/c2ccco2)C1=O)C(O)=O