Reaction Details
TargetGuanyl-specific ribonuclease T1
LigandBDBM51791
Substrate/Competitorn/a
Meas. Tech.Counterscreen for inhibitors of tRNA 2'-phosphotransferase (TPT1): fluorescence polarization-based biochemical high throughput dose response assay to identify inhibitors of RNAse T1.
IC50>55688±n/a nM
Citation PubChem, PC Counterscreen for inhibitors of tRNA 2'-phosphotransferase (TPT1): fluorescence polarization-based biochemical high throughput dose response assay to identify inhibitors of RNAse T1. PubChem Bioassay(2009)[AID]
 
Guanyl-specific ribonuclease T1
Name:Guanyl-specific ribonuclease T1
Type:Enzyme Catalytic Domain
Mol. Mass.:13952.57
Organism:Aspergillus oryzae
Description:gi_83774548
Residue:130
BDBM51791
NameBDBM51791
Synonyms:5-[(3,5-dimethyl-1-pyrazolyl)methyl]-N-[[5-(4-nitrophenyl)-2-furanyl]methylideneamino]-2-furancarboxamide 5-[(3,5-dimethylpyrazol-1-yl)methyl]-N-[[5-(4-nitrophenyl)-2-furyl]methyleneamino]-2-furamide MLS001240080 cid_1000028
TypeSmall organic molecule
Emp. Form.C22H19N5O5
Mol. Mass.433.4168
SMILESCc1cc(C)n(Cc2ccc(o2)C(=O)N\N=C\c2ccc(o2)-c2ccc(cc2)[N+]([O-])=O)n1