Reaction Details
TargetMetabotropic glutamate receptor 4 [Q124R]
LigandBDBM50293734
Substrate/Competitorn/a
Meas. Tech.Modulation of the Metabotropic Glutamate Receptor mGluR4: Rat PAM Potency
EC50 3370±n/a nM
Citation PubChem, PC Modulation of the Metabotropic Glutamate Receptor mGluR4: Rat PAM Potency PubChem Bioassay(2010)[AID]
 
Metabotropic glutamate receptor 4 [Q124R]
Name:Metabotropic glutamate receptor 4 [Q124R]
Type:Enzyme Catalytic Domain
Mol. Mass.:101878.86
Organism:Rattus norvegicus
Description:gi_12083595
Residue:912
BDBM50293734
NameBDBM50293734
Synonyms:CHEMBL560021 cid_44191099
TypeSmall organic molecule
Emp. Form.C11H7Cl2N3O
Mol. Mass.268.099
SMILESClc1ccc(NC(=O)c2ccncn2)cc1Cl