Reaction Details
TargetMetabotropic glutamate receptor 4 [Q124R]
LigandBDBM50293719
Substrate/Competitorn/a
Meas. Tech.Modulation of the Metabotropic Glutamate Receptor mGluR4: Rat PAM Potency
EC50 1830±n/a nM
Citation PubChem, PC Modulation of the Metabotropic Glutamate Receptor mGluR4: Rat PAM Potency PubChem Bioassay(2010)[AID]
 
Metabotropic glutamate receptor 4 [Q124R]
Name:Metabotropic glutamate receptor 4 [Q124R]
Type:Enzyme Catalytic Domain
Mol. Mass.:101878.86
Organism:Rattus norvegicus
Description:gi_12083595
Residue:912
BDBM50293719
NameBDBM50293719
Synonyms:CHEMBL571453 cid_2306530
TypeSmall organic molecule
Emp. Form.C13H9F3N2O
Mol. Mass.266.2186
SMILESFC(F)(F)c1cccc(NC(=O)c2ccccn2)c1