Reaction Details
TargetMetabotropic glutamate receptor 4 [Q124R]
LigandBDBM50293716
Substrate/Competitorn/a
Meas. Tech.Modulation of the Metabotropic Glutamate Receptor mGluR4: Rat PAM Potency
EC50 738±n/a nM
Citation PubChem, PC Modulation of the Metabotropic Glutamate Receptor mGluR4: Rat PAM Potency PubChem Bioassay(2010)[AID]
 
Metabotropic glutamate receptor 4 [Q124R]
Name:Metabotropic glutamate receptor 4 [Q124R]
Type:Enzyme Catalytic Domain
Mol. Mass.:101878.86
Organism:Rattus norvegicus
Description:gi_12083595
Residue:912
BDBM50293716
NameBDBM50293716
Synonyms:CHEMBL562232 cid_2442621
TypeSmall organic molecule
Emp. Form.C13H11ClN2O2
Mol. Mass.262.692
SMILESCOc1ccc(NC(=O)c2ccccn2)cc1Cl