Reaction Details
TargetMetabotropic glutamate receptor 4 [Q124R]
LigandBDBM50293743
Substrate/Competitorn/a
Meas. Tech.Modulation of the Metabotropic Glutamate Receptor mGluR4: Rat PAM Potency
EC50 295±n/a nM
Citation PubChem, PC Modulation of the Metabotropic Glutamate Receptor mGluR4: Rat PAM Potency PubChem Bioassay(2010)[AID]
 
Metabotropic glutamate receptor 4 [Q124R]
Name:Metabotropic glutamate receptor 4 [Q124R]
Type:Enzyme Catalytic Domain
Mol. Mass.:101878.86
Organism:Rattus norvegicus
Description:gi_12083595
Residue:912
BDBM50293743
NameBDBM50293743
Synonyms:CHEMBL556667 cid_836002
TypeSmall organic molecule
Emp. Form.C12H9ClN2O
Mol. Mass.232.666
SMILESClc1cccc(NC(=O)c2ccccn2)c1