Reaction Details
TargetMetabotropic glutamate receptor 4 [Q124R]
LigandBDBM55085
Substrate/Competitorn/a
Meas. Tech.Modulation of the Metabotropic Glutamate Receptor mGluR4: Rat PAM Potency
EC50 6890±n/a nM
Citation PubChem, PC Modulation of the Metabotropic Glutamate Receptor mGluR4: Rat PAM Potency PubChem Bioassay(2010)[AID]
 
Metabotropic glutamate receptor 4 [Q124R]
Name:Metabotropic glutamate receptor 4 [Q124R]
Type:Enzyme Catalytic Domain
Mol. Mass.:101878.86
Organism:Rattus norvegicus
Description:gi_12083595
Residue:912
BDBM55085
NameBDBM55085
Synonyms:N-(3-chloro-4-succinimido-phenyl)picolinamide N-[3-chloro-4-(2,5-dioxopyrrolidin-1-yl)phenyl]pyridine-2-carboxamide VU0365485-1 | cid_46869943
TypeSmall organic molecule
Emp. Form.C16H12ClN3O3
Mol. Mass.329.738
SMILESOc1ccc(O)n1-c1ccc(NC(=O)c2ccccn2)cc1Cl