Reaction Details
TargetMetabotropic glutamate receptor 4 [Q124R]
LigandBDBM55081
Substrate/Competitorn/a
Meas. Tech.Modulation of the Metabotropic Glutamate Receptor mGluR4: Rat PAM Potency
EC50 380±n/a nM
Citation PubChem, PC Modulation of the Metabotropic Glutamate Receptor mGluR4: Rat PAM Potency PubChem Bioassay(2010)[AID]
 
Metabotropic glutamate receptor 4 [Q124R]
Name:Metabotropic glutamate receptor 4 [Q124R]
Type:Enzyme Catalytic Domain
Mol. Mass.:101878.86
Organism:Rattus norvegicus
Description:gi_12083595
Residue:912
BDBM55081
NameBDBM55081
Synonyms:ML182 cid_46869947
TypeSmall organic molecule
Emp. Form.C21H16ClN3O3
Mol. Mass.393.823
SMILES[H][C@@]12C[C@@]([H])(C=C1)[C@]1([H])C2C(=O)N(C1=O)c1ccc(NC(=O)c2ccccn2)cc1Cl