Reaction Details
TargetMetabotropic glutamate receptor 4 [Q124R]
LigandBDBM55090
Substrate/Competitorn/a
Meas. Tech.Modulation of the Metabotropic Glutamate Receptor mGluR4: Rat PAM Potency
EC50 250±n/a nM
Citation PubChem, PC Modulation of the Metabotropic Glutamate Receptor mGluR4: Rat PAM Potency PubChem Bioassay(2010)[AID]
 
Metabotropic glutamate receptor 4 [Q124R]
Name:Metabotropic glutamate receptor 4 [Q124R]
Type:Enzyme Catalytic Domain
Mol. Mass.:101878.86
Organism:Rattus norvegicus
Description:gi_12083595
Residue:912
BDBM55090
NameBDBM55090
Synonyms:VU0404304-2 | cid_46869948
TypeSmall organic molecule
Emp. Form.C22H18ClN3O3
Mol. Mass.407.85
SMILES[H][C@@]12C(C(=O)N(C1=O)c1ccc(NC(=O)c3ccccn3)cc1Cl)[C@@]1([H])CC[C@]2([H])C=C1