Reaction Details
TargetMetabotropic glutamate receptor 4 [Q124R]
LigandBDBM55094
Substrate/Competitorn/a
Meas. Tech.Modulation of the Metabotropic Glutamate Receptor mGluR4: Rat PAM Potency
EC50 490±n/a nM
Citation PubChem, PC Modulation of the Metabotropic Glutamate Receptor mGluR4: Rat PAM Potency PubChem Bioassay(2010)[AID]
 
Metabotropic glutamate receptor 4 [Q124R]
Name:Metabotropic glutamate receptor 4 [Q124R]
Type:Enzyme Catalytic Domain
Mol. Mass.:101878.86
Organism:Rattus norvegicus
Description:gi_12083595
Residue:912
BDBM55094
NameBDBM55094
Synonyms:N-[3-chloro-4-(2,5-diketo-3-phenyl-pyrrolidino)phenyl]picolinamide N-[3-chloro-4-(2,5-dioxo-3-phenylpyrrolidin-1-yl)phenyl]pyridine-2-carboxamide VU0400071-3 | cid_45110765
TypeSmall organic molecule
Emp. Form.C22H16ClN3O3
Mol. Mass.405.834
SMILESOc1cc(c(O)n1-c1ccc(NC(=O)c2ccccn2)cc1Cl)-c1ccccc1