Reaction Details
TargetM18 aspartyl aminopeptidase
LigandBDBM34340
Substrate/Competitorn/a
Meas. Tech.QFRET-based biochemical high throughput dose response assay for inhibitors of the Plasmodium falciparum M18 Aspartyl Aminopeptidase (PFM18AAP).
IC50 4284±n/a nM
Citation PubChem, PC QFRET-based biochemical high throughput dose response assay for inhibitors of the Plasmodium falciparum M18 Aspartyl Aminopeptidase (PFM18AAP). PubChem Bioassay(2009)[AID]
 
M18 aspartyl aminopeptidase
Name:M18 aspartyl aminopeptidase
Synonyms:n/a
Type:Enzyme Catalytic Domain
Mol. Mass.:65642.43
Organism:Plasmodium falciparum 3D7
Description:gi_23505220
Residue:570
BDBM34340
NameBDBM34340
TypeSmall organic molecule
Emp. Form.C19H20N2O3S2
Mol. Mass.388.504
SMILESCc1ccc(cc1S(=O)(=O)N1CCCCC1)-n1sc2ccccc2c1=O