Reaction Details
TargetM18 aspartyl aminopeptidase
LigandBDBM55138
Substrate/Competitorn/a
Meas. Tech.QFRET-based biochemical high throughput dose response assay for inhibitors of the Plasmodium falciparum M18 Aspartyl Aminopeptidase (PFM18AAP).
IC50 806.57±n/a nM
Citation PubChem, PC QFRET-based biochemical high throughput dose response assay for inhibitors of the Plasmodium falciparum M18 Aspartyl Aminopeptidase (PFM18AAP). PubChem Bioassay(2009)[AID]
 
M18 aspartyl aminopeptidase
Name:M18 aspartyl aminopeptidase
Synonyms:n/a
Type:Enzyme Catalytic Domain
Mol. Mass.:65642.43
Organism:Plasmodium falciparum 3D7
Description:gi_23505220
Residue:570
BDBM55138
NameBDBM55138
TypeSmall organic molecule
Emp. Form.C17H18BrNO2
Mol. Mass.348.234
SMILESCC(C)(C)c1ccc(O)c(c1)N=Cc1cc(Br)ccc1O