Reaction Details
TargetM18 aspartyl aminopeptidase
LigandBDBM55141
Substrate/Competitorn/a
Meas. Tech.QFRET-based biochemical high throughput dose response assay for inhibitors of the Plasmodium falciparum M18 Aspartyl Aminopeptidase (PFM18AAP).
IC50 921±n/a nM
Citation PubChem, PC QFRET-based biochemical high throughput dose response assay for inhibitors of the Plasmodium falciparum M18 Aspartyl Aminopeptidase (PFM18AAP). PubChem Bioassay(2009)[AID]
 
M18 aspartyl aminopeptidase
Name:M18 aspartyl aminopeptidase
Synonyms:n/a
Type:Enzyme Catalytic Domain
Mol. Mass.:65642.43
Organism:Plasmodium falciparum 3D7
Description:gi_23505220
Residue:570
BDBM55141
NameBDBM55141
TypeSmall organic molecule
Emp. Form.C16H21N5O4S
Mol. Mass.379.434
SMILESCCOc1cc(cc(OCC)c1OCC)C(=O)NC(=S)Nn1cnnc1