Reaction Details
TargetM18 aspartyl aminopeptidase
LigandBDBM55142
Substrate/Competitorn/a
Meas. Tech.QFRET-based biochemical high throughput dose response assay for inhibitors of the Plasmodium falciparum M18 Aspartyl Aminopeptidase (PFM18AAP).
IC50 609.09±n/a nM
Citation PubChem, PC QFRET-based biochemical high throughput dose response assay for inhibitors of the Plasmodium falciparum M18 Aspartyl Aminopeptidase (PFM18AAP). PubChem Bioassay(2009)[AID]
 
M18 aspartyl aminopeptidase
Name:M18 aspartyl aminopeptidase
Synonyms:n/a
Type:Enzyme Catalytic Domain
Mol. Mass.:65642.43
Organism:Plasmodium falciparum 3D7
Description:gi_23505220
Residue:570
BDBM55142
NameBDBM55142
TypeSmall organic molecule
Emp. Form.C14H13N5O7S
Mol. Mass.395.347
SMILESCCOC(=O)NC(=O)COC(=O)c1ccc(Sc2nnc[nH]2)c(c1)[N+]([O-])=O