Reaction Details
TargetM18 aspartyl aminopeptidase
LigandBDBM50088347
Substrate/Competitorn/a
Meas. Tech.QFRET-based biochemical high throughput dose response assay for inhibitors of the Plasmodium falciparum M18 Aspartyl Aminopeptidase (PFM18AAP).
IC50 1945±n/a nM
Citation PubChem, PC QFRET-based biochemical high throughput dose response assay for inhibitors of the Plasmodium falciparum M18 Aspartyl Aminopeptidase (PFM18AAP). PubChem Bioassay(2009)[AID]
 
M18 aspartyl aminopeptidase
Name:M18 aspartyl aminopeptidase
Synonyms:n/a
Type:Enzyme Catalytic Domain
Mol. Mass.:65642.43
Organism:Plasmodium falciparum 3D7
Description:gi_23505220
Residue:570
BDBM50088347
NameBDBM50088347
TypeSmall organic molecule
Emp. Form.C25H24O12
Mol. Mass.516.4509
SMILESOC1CC(CC(O)C1OC(=O)\C=C/c1ccc(O)c(O)c1)(OC(=O)\C=C/c1ccc(O)c(O)c1)C(O)=O