Reaction Details
TargetM18 aspartyl aminopeptidase
LigandBDBM55146
Substrate/Competitorn/a
Meas. Tech.QFRET-based biochemical high throughput dose response assay for inhibitors of the Plasmodium falciparum M18 Aspartyl Aminopeptidase (PFM18AAP).
IC50 1185±n/a nM
Citation PubChem, PC QFRET-based biochemical high throughput dose response assay for inhibitors of the Plasmodium falciparum M18 Aspartyl Aminopeptidase (PFM18AAP). PubChem Bioassay(2009)[AID]
 
M18 aspartyl aminopeptidase
Name:M18 aspartyl aminopeptidase
Synonyms:n/a
Type:Enzyme Catalytic Domain
Mol. Mass.:65642.43
Organism:Plasmodium falciparum 3D7
Description:gi_23505220
Residue:570
BDBM55146
NameBDBM55146
TypeSmall organic molecule
Emp. Form.C16H20N4O6
Mol. Mass.364.3532
SMILESCC1(C)C2(CN3CC1(CN(C2)C3c1ccc(O)c(O)c1)[N+]([O-])=O)[N+]([O-])=O