Reaction Details
TargetM18 aspartyl aminopeptidase
LigandBDBM53091
Substrate/Competitorn/a
Meas. Tech.QFRET-based biochemical high throughput dose response assay for inhibitors of the Plasmodium falciparum M18 Aspartyl Aminopeptidase (PFM18AAP).
IC50 669.88±n/a nM
Citation PubChem, PC QFRET-based biochemical high throughput dose response assay for inhibitors of the Plasmodium falciparum M18 Aspartyl Aminopeptidase (PFM18AAP). PubChem Bioassay(2009)[AID]
 
M18 aspartyl aminopeptidase
Name:M18 aspartyl aminopeptidase
Synonyms:n/a
Type:Enzyme Catalytic Domain
Mol. Mass.:65642.43
Organism:Plasmodium falciparum 3D7
Description:gi_23505220
Residue:570
BDBM53091
NameBDBM53091
TypeSmall organic molecule
Emp. Form.C12H9N3O6
Mol. Mass.291.2164
SMILESOc1[nH+]c(\C=C\[c-]2ccc(=O)c(O)c2)[nH]c(=O)c1[N+]([O-])=O