Reaction Details
TargetM18 aspartyl aminopeptidase
LigandBDBM55160
Substrate/Competitorn/a
Meas. Tech.QFRET-based biochemical high throughput dose response assay for inhibitors of the Plasmodium falciparum M18 Aspartyl Aminopeptidase (PFM18AAP).
IC50 1516±n/a nM
Citation PubChem, PC QFRET-based biochemical high throughput dose response assay for inhibitors of the Plasmodium falciparum M18 Aspartyl Aminopeptidase (PFM18AAP). PubChem Bioassay(2009)[AID]
 
M18 aspartyl aminopeptidase
Name:M18 aspartyl aminopeptidase
Synonyms:n/a
Type:Enzyme Catalytic Domain
Mol. Mass.:65642.43
Organism:Plasmodium falciparum 3D7
Description:gi_23505220
Residue:570
BDBM55160
NameBDBM55160
TypeSmall organic molecule
Emp. Form.C20H19FN2O7S
Mol. Mass.450.437
SMILESCCOC(=O)C1C(NC(=O)N=C1CS(=O)(=O)c1ccc(F)cc1)c1ccc(O)c(O)c1