Reaction Details
TargetM18 aspartyl aminopeptidase
LigandBDBM55169
Substrate/Competitorn/a
Meas. Tech.QFRET-based biochemical high throughput dose response assay for inhibitors of the Plasmodium falciparum M18 Aspartyl Aminopeptidase (PFM18AAP).
IC50 352.84±n/a nM
Citation PubChem, PC QFRET-based biochemical high throughput dose response assay for inhibitors of the Plasmodium falciparum M18 Aspartyl Aminopeptidase (PFM18AAP). PubChem Bioassay(2009)[AID]
 
M18 aspartyl aminopeptidase
Name:M18 aspartyl aminopeptidase
Synonyms:n/a
Type:Enzyme Catalytic Domain
Mol. Mass.:65642.43
Organism:Plasmodium falciparum 3D7
Description:gi_23505220
Residue:570
BDBM55169
NameBDBM55169
TypeSmall organic molecule
Emp. Form.C10H10N6O4
Mol. Mass.278.2242
SMILESCOc1cc(ccc1NC(=O)Nn1cnnc1)[N+]([O-])=O