Reaction Details
TargetM18 aspartyl aminopeptidase
LigandBDBM55174
Substrate/Competitorn/a
Meas. Tech.QFRET-based biochemical high throughput dose response assay for inhibitors of the Plasmodium falciparum M18 Aspartyl Aminopeptidase (PFM18AAP).
IC50 1457±n/a nM
Citation PubChem, PC QFRET-based biochemical high throughput dose response assay for inhibitors of the Plasmodium falciparum M18 Aspartyl Aminopeptidase (PFM18AAP). PubChem Bioassay(2009)[AID]
 
M18 aspartyl aminopeptidase
Name:M18 aspartyl aminopeptidase
Synonyms:n/a
Type:Enzyme Catalytic Domain
Mol. Mass.:65642.43
Organism:Plasmodium falciparum 3D7
Description:gi_23505220
Residue:570
BDBM55174
NameBDBM55174
TypeSmall organic molecule
Emp. Form.C9H7ClFN5O
Mol. Mass.255.636
SMILESFc1ccc(NC(=O)Nn2cnnc2)cc1Cl