Reaction Details
TargetProcathepsin L
LigandBDBM40728
Substrate/Competitorn/a
Meas. Tech.QFRET-based counterscreen for inhibitors of PFM18AAP: biochemical high throughput dose response assay for inhibitors of the Cathepsin L proteinase (CTSL1).
IC50>59642±n/a nM
Citation PubChem, PC QFRET-based counterscreen for inhibitors of PFM18AAP: biochemical high throughput dose response assay for inhibitors of the Cathepsin L proteinase (CTSL1). PubChem Bioassay(2009)[AID]
 
Procathepsin L
Name:Procathepsin L
Type:Enzyme
Mol. Mass.:37557.19
Organism:Homo sapiens (Human)
Description:Purchased from Calbiochem (San Diego, CA).
Residue:333
BDBM40728
NameBDBM40728
Synonyms:2-[2-oxidanylidene-2-[2-[(Z)-(3-oxidanyl-4-oxidanylidene-cyclohexa-2,5-dien-1-ylidene)methyl]hydrazinyl]ethoxy]-N''-[(Z)-(3-oxidanyl-4-oxidanylidene-cyclohexa-2,5-dien-1-ylidene)methyl]benzohydrazide N'-(3,4-dihydroxybenzylidene)-2-{2-[2-(3,4-dihydroxybenzylidene)hydrazino]-2-oxoethoxy}benzohydrazide N''-[(Z)-(3-hydroxy-4-oxo-1-cyclohexa-2,5-dienylidene)methyl]-2-[2-[[(Z)-(3-hydroxy-4-oxo-1-cyclohexa-2,5-dienylidene)methyl]hydrazo]-2-oxoethoxy]benzohydrazide N'-[(Z)-(3-hydroxy-4-keto-cyclohexa-2,5-dien-1-ylidene)methyl]-2-[2-[N'-[(E)-(3-hydroxy-4-keto-cyclohexa-2,5-dien-1-ylidene)methyl]hydrazino]-2-keto-ethoxy]benzohydrazide SMR000161891 | cid_11958779
TypeSmall organic molecule
Emp. Form.C23H20N4O7
Mol. Mass.464.4275
SMILESOc1ccc(C=NNC(=O)COc2ccccc2C(=O)NN=Cc2ccc(O)c(O)c2)cc1O