Reaction Details
TargetMetabotropic glutamate receptor 4
LigandBDBM50293722
Substrate/Competitorn/a
Meas. Tech.Modulation of the Metabotropic Glutamate Receptor mGluR4: Potency at human mGluR4
EC50 4320±n/a nM
Citation PubChem, PC Modulation of the Metabotropic Glutamate Receptor mGluR4: Potency at human mGluR4 PubChem Bioassay(2010)[AID]
 
Metabotropic glutamate receptor 4
Name:Metabotropic glutamate receptor 4
Type:Protein
Mol. Mass.:101899.95
Organism:Homo sapiens (Human)
Description:Q14833
Residue:912
BDBM50293722
NameBDBM50293722
Synonyms:CHEMBL559271 cid_38032499
TypeSmall organic molecule
Emp. Form.C13H9F3N2O2
Mol. Mass.282.218
SMILESFC(F)(F)Oc1cccc(NC(=O)c2ccccn2)c1