Reaction Details
TargetMetabotropic glutamate receptor 5
LigandBDBM50293743
Substrate/Competitorn/a
Meas. Tech.Modulation of the Metabotropic Glutamate Receptor mGluR4: Selectivity at mGluR5
EC50 377±n/a nM
Citation PubChem, PC Modulation of the Metabotropic Glutamate Receptor mGluR4: Selectivity at mGluR5 PubChem Bioassay(2010)[AID]
 
Metabotropic glutamate receptor 5
Name:Metabotropic glutamate receptor 5
Type:Enzyme
Mol. Mass.:131900.14
Organism:Rattus norvegicus (Rat)
Description:P31424
Residue:1203
BDBM50293743
NameBDBM50293743
Synonyms:CHEMBL556667 cid_836002
TypeSmall organic molecule
Emp. Form.C12H9ClN2O
Mol. Mass.232.666
SMILESClc1cccc(NC(=O)c2ccccn2)c1