Reaction Details
TargetNeutrophil cytosol factor 1 [S99G]
LigandBDBM43856
Substrate/Competitorn/a
Meas. Tech.Dose Response Confirmation for small molecular inhibitors for p47phox, a regulatory protein of NADPH oxidases (Noxs)
IC50 50000±n/a nM
Citation PubChem, PC Dose Response Confirmation for small molecular inhibitors for p47phox, a regulatory protein of NADPH oxidases (Noxs) PubChem Bioassay(2008)[AID]
 
Neutrophil cytosol factor 1 [S99G]
Name:Neutrophil cytosol factor 1 [S99G]
Type:Enzyme Catalytic Domain
Mol. Mass.:44664.39
Organism:Homo sapiens (Human)
Description:gi_115298672
Residue:390
BDBM43856
NameBDBM43856
Synonyms:4-ethoxy-N-[(6-fluoro-1,1-diketo-2,3-dihydrothiochromen-4-ylidene)amino]benzenesulfonamide 4-ethoxy-N-[(6-fluoro-1,1-dioxo-2,3-dihydrothiochromen-4-ylidene)amino]benzenesulfonamide MLS000761277 SMR000369580 | cid_3596078
TypeSmall organic molecule
Emp. Form.C17H17FN2O5S2
Mol. Mass.412.456
SMILESCCOc1ccc(cc1)S(=O)(=O)NN=C1CCS(=O)(=O)c2ccc(F)cc12