Reaction Details
TargetKallikrein-5
LigandBDBM32665
Substrate/Competitorn/a
Meas. Tech.Kallikrein 5 1536 HTS Dose Response Confirmation
IC50 472.57±n/a nM
Citation PubChem, PC Kallikrein 5 1536 HTS Dose Response Confirmation PubChem Bioassay(2008)[AID]
 
Kallikrein-5
Name:Kallikrein-5
Type:PROTEIN
Mol. Mass.:32031.72
Organism:Homo sapiens (Human)
Description:EBI_12584
Residue:293
BDBM32665
NameBDBM32665
Synonyms:2-furancarboxylic acid [5-amino-1-(4-methylphenyl)sulfonyl-3-pyrazolyl] ester Furan-2-carboxylic acid 5-amino-1-(toluene-4-sulfonyl)-1H-pyrazol-3-yl ester SMR000014913 [5-amino-1-(4-methylphenyl)sulfonylpyrazol-3-yl] furan-2-carboxylate cid_651936 | furan-2-carboxylic acid (5-amino-1-tosyl-pyrazol-3-yl) ester
TypeSmall organic molecule
Emp. Form.C15H13N3O5S
Mol. Mass.347.346
SMILESCc1ccc(cc1)S(=O)(=O)n1nc(OC(=O)c2ccco2)cc1N