Reaction Details
TargetKallikrein-5
LigandBDBM32761
Substrate/Competitorn/a
Meas. Tech.Kallikrein 5 1536 HTS Dose Response Confirmation
IC50 510.78±n/a nM
Citation PubChem, PC Kallikrein 5 1536 HTS Dose Response Confirmation PubChem Bioassay(2008)[AID]
 
Kallikrein-5
Name:Kallikrein-5
Type:PROTEIN
Mol. Mass.:32031.72
Organism:Homo sapiens (Human)
Description:EBI_12584
Residue:293
BDBM32761
NameBDBM32761
Synonyms:2-furancarboxylic acid [5-amino-1-(4-methoxyphenyl)sulfonyl-3-pyrazolyl] ester MLS000033887 US11584714, Compound 40# [5-azanyl-1-(4-methoxyphenyl)sulfonyl-pyrazol-3-yl] furan-2-carboxylate furan-2-carboxylic acid [5-amino-1-(4-methoxyphenyl)sulfonyl-pyrazol-3-yl] ester
TypeSmall organic molecule
Emp. Form.C15H13N3O6S
Mol. Mass.363.345
SMILESCOc1ccc(cc1)S(=O)(=O)n1nc(OC(=O)c2ccco2)cc1N