Reaction Details
TargetKallikrein-5
LigandBDBM32783
Substrate/Competitorn/a
Meas. Tech.Kallikrein 5 1536 HTS Dose Response Confirmation
IC50 824.37±n/a nM
Citation PubChem, PC Kallikrein 5 1536 HTS Dose Response Confirmation PubChem Bioassay(2008)[AID]
 
Kallikrein-5
Name:Kallikrein-5
Type:PROTEIN
Mol. Mass.:32031.72
Organism:Homo sapiens (Human)
Description:EBI_12584
Residue:293
BDBM32783
NameBDBM32783
Synonyms:2-thiophenecarboxylic acid [5-amino-1-(4-fluorophenyl)sulfonyl-3-pyrazolyl] ester CHEMBL390485 SMR000021568 [5-azanyl-1-(4-fluorophenyl)sulfonyl-pyrazol-3-yl] thiophene-2-carboxylate thiophene-2-carboxylic acid [5-amino-1-(4-fluorophenyl)sulfonyl-pyrazol-3-yl] ester
TypeSmall organic molecule
Emp. Form.C14H10FN3O4S2
Mol. Mass.367.375
SMILESNc1cc(OC(=O)c2cccs2)nn1S(=O)(=O)c1ccc(F)cc1