Reaction Details
TargetKallikrein-5
LigandBDBM32787
Substrate/Competitorn/a
Meas. Tech.Kallikrein 5 1536 HTS Dose Response Confirmation
IC50 253.51±n/a nM
Citation PubChem, PC Kallikrein 5 1536 HTS Dose Response Confirmation PubChem Bioassay(2008)[AID]
 
Kallikrein-5
Name:Kallikrein-5
Type:PROTEIN
Mol. Mass.:32031.72
Organism:Homo sapiens (Human)
Description:EBI_12584
Residue:293
BDBM32787
NameBDBM32787
Synonyms:1-[2-(ethylthio)benzoyl]-1H-1,2,3-benzotriazole MLS000050138 benzotriazol-1-yl-(2-ethylsulfanylphenyl)methanone cid_2212050
TypeSmall organic molecule
Emp. Form.C15H13N3OS
Mol. Mass.283.348
SMILESCCSc1ccccc1C(=O)n1nnc2ccccc12