Reaction Details
TargetKallikrein-5
LigandBDBM32791
Substrate/Competitorn/a
Meas. Tech.Kallikrein 5 1536 HTS Dose Response Confirmation
IC50 1092.57±n/a nM
Citation PubChem, PC Kallikrein 5 1536 HTS Dose Response Confirmation PubChem Bioassay(2008)[AID]
 
Kallikrein-5
Name:Kallikrein-5
Type:PROTEIN
Mol. Mass.:32031.72
Organism:Homo sapiens (Human)
Description:EBI_12584
Residue:293
BDBM32791
NameBDBM32791
Synonyms:1-(1-benzothien-3-ylcarbonyl)-1H-pyrazole 1-benzothiophen-3-yl(pyrazol-1-yl)methanone SMR000080341 cid_841465
TypeSmall organic molecule
Emp. Form.C12H8N2OS
Mol. Mass.228.27
SMILESO=C(c1csc2ccccc12)n1cccn1