Reaction Details
TargetKallikrein-5
LigandBDBM33437
Substrate/Competitorn/a
Meas. Tech.Kallikrein 5 1536 HTS Dose Response Confirmation
IC50 2115.37±n/a nM
Citation PubChem, PC Kallikrein 5 1536 HTS Dose Response Confirmation PubChem Bioassay(2008)[AID]
 
Kallikrein-5
Name:Kallikrein-5
Type:PROTEIN
Mol. Mass.:32031.72
Organism:Homo sapiens (Human)
Description:EBI_12584
Residue:293
BDBM33437
NameBDBM33437
Synonyms:(5-amino-3-phenyl-1,2,4-triazol-1-yl)-(3,4-dimethoxyphenyl)methanone 1-(3,4-dimethoxybenzoyl)-3-phenyl-1H-1,2,4-triazol-5-amine SMR000074479 | cid_975107
TypeSmall organic molecule
Emp. Form.C17H16N4O3
Mol. Mass.324.3339
SMILESCOc1ccc(cc1OC)C(=O)n1nc(nc1N)-c1ccccc1