Reaction Details
TargetKallikrein-5
LigandBDBM31039
Substrate/Competitorn/a
Meas. Tech.Kallikrein 5 1536 HTS Dose Response Confirmation
IC50 50000±n/a nM
Citation PubChem, PC Kallikrein 5 1536 HTS Dose Response Confirmation PubChem Bioassay(2008)[AID]
 
Kallikrein-5
Name:Kallikrein-5
Type:PROTEIN
Mol. Mass.:32031.72
Organism:Homo sapiens (Human)
Description:EBI_12584
Residue:293
BDBM31039
NameBDBM31039
Synonyms:2,6-dimethyl-4-(1-phenyl-1,2,3,4-tetrazol-5-yl)morpholine 2,6-dimethyl-4-(1-phenyltetrazol-5-yl)morpholine SMR000109556 | cid_2928885
TypeSmall organic molecule
Emp. Form.C13H17N5O
Mol. Mass.259.307
SMILESCC1CN(CC(C)O1)c1nnnn1-c1ccccc1