Reaction Details
TargetKallikrein-5
LigandBDBM33454
Substrate/Competitorn/a
Meas. Tech.Kallikrein 5 1536 HTS Dose Response Confirmation
IC50 943.18±n/a nM
Citation PubChem, PC Kallikrein 5 1536 HTS Dose Response Confirmation PubChem Bioassay(2008)[AID]
 
Kallikrein-5
Name:Kallikrein-5
Type:PROTEIN
Mol. Mass.:32031.72
Organism:Homo sapiens (Human)
Description:EBI_12584
Residue:293
BDBM33454
NameBDBM33454
Synonyms:(5-Amino-3-furan-2-yl-[1,2,4]triazol-1-yl)-(4-methoxy-phenyl)-methanone SMR000121454 [5-amino-3-(2-furyl)-1,2,4-triazol-1-yl]-(4-methoxyphenyl)methanone [5-azanyl-3-(furan-2-yl)-1,2,4-triazol-1-yl]-(4-methoxyphenyl)methanone | cid_1084416
TypeSmall organic molecule
Emp. Form.C14H12N4O3
Mol. Mass.284.2701
SMILESCOc1ccc(cc1)C(=O)n1nc(nc1N)-c1ccco1