Reaction Details
TargetKallikrein-5
LigandBDBM32815
Substrate/Competitorn/a
Meas. Tech.Kallikrein 5 1536 HTS Dose Response Confirmation
IC50 2001.51±n/a nM
Citation PubChem, PC Kallikrein 5 1536 HTS Dose Response Confirmation PubChem Bioassay(2008)[AID]
 
Kallikrein-5
Name:Kallikrein-5
Type:PROTEIN
Mol. Mass.:32031.72
Organism:Homo sapiens (Human)
Description:EBI_12584
Residue:293
BDBM32815
NameBDBM32815
Synonyms:1-benzotriazolyl-[3-(4-methoxyphenyl)-1-phenyl-4-pyrazolyl]methanone MLS000534987 benzotriazol-1-yl-[3-(4-methoxyphenyl)-1-phenyl-pyrazol-4-yl]methanone cid_1326637
TypeSmall organic molecule
Emp. Form.C23H17N5O2
Mol. Mass.395.4134
SMILESCOc1ccc(cc1)-c1nn(cc1C(=O)n1nnc2ccccc12)-c1ccccc1