Reaction Details
TargetKallikrein-5
LigandBDBM32820
Substrate/Competitorn/a
Meas. Tech.Kallikrein 5 1536 HTS Dose Response Confirmation
IC50 1706.14±n/a nM
Citation PubChem, PC Kallikrein 5 1536 HTS Dose Response Confirmation PubChem Bioassay(2008)[AID]
 
Kallikrein-5
Name:Kallikrein-5
Type:PROTEIN
Mol. Mass.:32031.72
Organism:Homo sapiens (Human)
Description:EBI_12584
Residue:293
BDBM32820
NameBDBM32820
Synonyms:1-benzotriazolyl-[4-(dimethylamino)phenyl]methanone SMR000129533 cid_694547
TypeSmall organic molecule
Emp. Form.C15H14N4O
Mol. Mass.266.2979
SMILESCN(C)c1ccc(cc1)C(=O)n1nnc2ccccc12