Reaction Details
TargetKallikrein-5
LigandBDBM32833
Substrate/Competitorn/a
Meas. Tech.Kallikrein 5 1536 HTS Dose Response Confirmation
IC50 316.25±n/a nM
Citation PubChem, PC Kallikrein 5 1536 HTS Dose Response Confirmation PubChem Bioassay(2008)[AID]
 
Kallikrein-5
Name:Kallikrein-5
Type:PROTEIN
Mol. Mass.:32031.72
Organism:Homo sapiens (Human)
Description:EBI_12584
Residue:293
BDBM32833
NameBDBM32833
Synonyms:(4-methoxyphenyl)-(5-methylsulfanyl-3-phenyl-1,2,4-triazol-1-yl)methanone MLS000545911 cid_828565 | methyl4-{[5-(methylthio)-3-phenyl-1H-1,2,4-triazol-1-yl]carbonyl}phenylether
TypeSmall organic molecule
Emp. Form.C17H15N3O2S
Mol. Mass.325.385
SMILESCOc1ccc(cc1)C(=O)n1nc(nc1SC)-c1ccccc1