Reaction Details
TargetKallikrein-5
LigandBDBM32881
Substrate/Competitorn/a
Meas. Tech.Kallikrein 5 1536 HTS Dose Response Confirmation
IC50 76±n/a nM
Citation PubChem, PC Kallikrein 5 1536 HTS Dose Response Confirmation PubChem Bioassay(2008)[AID]
 
Kallikrein-5
Name:Kallikrein-5
Type:PROTEIN
Mol. Mass.:32031.72
Organism:Homo sapiens (Human)
Description:EBI_12584
Residue:293
BDBM32881
NameBDBM32881
Synonyms:MLS000706208 [3-(2-furanyl)-5-(methylthio)-1,2,4-triazol-1-yl]-(2-methoxyphenyl)methanone [3-(furan-2-yl)-5-methylsulfanyl-1,2,4-triazol-1-yl]-(2-methoxyphenyl)methanone | cid_977140
TypeSmall organic molecule
Emp. Form.C15H13N3O3S
Mol. Mass.315.347
SMILESCOc1ccccc1C(=O)n1nc(nc1SC)-c1ccco1