Reaction Details
TargetKallikrein-5
LigandBDBM33906
Substrate/Competitorn/a
Meas. Tech.Kallikrein 5 1536 HTS Dose Response Confirmation
IC50 84.44±n/a nM
Citation PubChem, PC Kallikrein 5 1536 HTS Dose Response Confirmation PubChem Bioassay(2008)[AID]
 
Kallikrein-5
Name:Kallikrein-5
Type:PROTEIN
Mol. Mass.:32031.72
Organism:Homo sapiens (Human)
Description:EBI_12584
Residue:293
BDBM33906
NameBDBM33906
Synonyms:5-amino-1-(4-methoxybenzoyl)pyrazole-4-carbonitrile 5-amino-1-p-anisoyl-pyrazole-4-carbonitrile MLS001005431 cid_2405928
TypeSmall organic molecule
Emp. Form.C12H10N4O2
Mol. Mass.242.2334
SMILESCOc1ccc(cc1)C(=O)n1ncc(C#N)c1N