Reaction Details
TargetStreptokinase A
LigandBDBM56897
Substrate/Competitorn/a
Meas. Tech.Absorbance Microorganism-Based Dose Response HTS to Identify Inhibitors of Streptokinase Expression
EC50 150000±n/a nM
Citation PubChem, PC Absorbance Microorganism-Based Dose Response HTS to Identify Inhibitors of Streptokinase Expression PubChem Bioassay(2009)[AID]
 
Streptokinase A
Name:Streptokinase A
Type:Enzyme Catalytic Domain
Mol. Mass.:49924.80
Organism:Streptococcus pyogenes M1 GAS
Description:gi_15675770
Residue:440
BDBM56897
NameBDBM56897
Synonyms:MLS000071820 N-[2-(4-methoxyphenyl)-6-methyl-5-benzotriazolyl]-2-methylpropanamide N-[2-(4-methoxyphenyl)-6-methyl-benzotriazol-5-yl]-2-methyl-propionamide SMR000011222 | cid_651820
TypeSmall organic molecule
Emp. Form.C18H20N4O2
Mol. Mass.324.377
SMILESCOc1ccc(cc1)-n1nc2cc(C)c(NC(=O)C(C)C)cc2n1