Reaction Details
TargetStreptokinase A
LigandBDBM46667
Substrate/Competitorn/a
Meas. Tech.Absorbance Microorganism-Based Dose Response HTS to Identify Inhibitors of Streptokinase Expression
EC50 150000±n/a nM
Citation PubChem, PC Absorbance Microorganism-Based Dose Response HTS to Identify Inhibitors of Streptokinase Expression PubChem Bioassay(2009)[AID]
 
Streptokinase A
Name:Streptokinase A
Type:Enzyme Catalytic Domain
Mol. Mass.:49924.80
Organism:Streptococcus pyogenes M1 GAS
Description:gi_15675770
Residue:440
BDBM46667
NameBDBM46667
Synonyms:2-phenyl-1,2-benzothiazol-3-one MLS-0107957.0001 cid_164981
TypeSmall organic molecule
Emp. Form.C13H9NOS
Mol. Mass.227.282
SMILESO=c1n(sc2ccccc12)-c1ccccc1